Maven/Gradle 编译错误解决:java.lang.RuntimeException: Unexpected error: java.security.InvalidAlgorithmParameterException: the trustAnchors parameter must be non-empty

551 记录 发表评论
Maven 或者 Gradle 编译遇到如下问题: ➜ idaas git:(main) ./gradlew build > Task :generateProto FAILED FAILURE: Build failed with an exception. * What went wrong: Execution failed for task ':generateProto'. > Could not resolve all files for configuration ':protobufToolsLocator_protoc'. > Could…